Reaction Details
Target5-hydroxytryptamine receptor 6
LigandBDBM50011175
Substrate/Competitorn/a
Meas. Tech.ChEMBL_1351619 (CHEMBL3268952)
Ki 0.340000±n/a nM
Citation Rosse, G Quinoline Derivatives as 5-HT6 Receptor PET Ligands. ACS Med Chem Lett5:275-6 (2014) 
 
5-hydroxytryptamine receptor 6
Name:5-hydroxytryptamine receptor 6
Type:G Protein-Coupled Receptor (GPCR)
Mol. Mass.:46968.43
Organism:Homo sapiens (Human)
Description:P50406
Residue:440
BDBM50011175
NameBDBM50011175
Synonyms:CHEMBL3260313
TypeSmall organic molecule
Emp. Form.C20H20FN3O2S
Mol. Mass.385.455
SMILESCN1CCN(CC1)c1cccc2cc(cnc12)S(=O)(=O)c1cccc(F)c1