Reaction Details
Target5-hydroxytryptamine receptor 2A
LigandBDBM50011175
Substrate/Competitorn/a
Meas. Tech.ChEMBL_1351620 (CHEMBL3268953)
Ki 0.390000±n/a nM
Citation Rosse, G Quinoline Derivatives as 5-HT6 Receptor PET Ligands. ACS Med Chem Lett5:275-6 (2014) 
 
5-hydroxytryptamine receptor 2A
Name:5-hydroxytryptamine receptor 2A
Type:undefined
Mol. Mass.:52607.65
Organism:Homo sapiens (Human)
Description:P28223
Residue:471
BDBM50011175
NameBDBM50011175
Synonyms:CHEMBL3260313
TypeSmall organic molecule
Emp. Form.C20H20FN3O2S
Mol. Mass.385.455
SMILESCN1CCN(CC1)c1cccc2cc(cnc12)S(=O)(=O)c1cccc(F)c1