Reaction Details
TargetMitotic checkpoint serine/threonine-protein kinase BUB1
LigandBDBM50011200
Substrate/Competitorn/a
Meas. Tech.ChEMBL_1351814 (CHEMBL3271320)
IC50 500±n/a nM
Citation Brazeau, JFRosse, G Novel cycloalkenepyrazoles as inhibitors of bub1 kinase. ACS Med Chem Lett5:280-1 (2014) 
 
Mitotic checkpoint serine/threonine-protein kinase BUB1
Name:Mitotic checkpoint serine/threonine-protein kinase BUB1
Type:PROTEIN
Mol. Mass.:122372.31
Organism:Homo sapiens (Human)
Description:ChEMBL_1510603
Residue:1085
BDBM50011200
NameBDBM50011200
Synonyms:CHEMBL3260327
TypeSmall organic molecule
Emp. Form.C34H31FN6O5
Mol. Mass.622.6455
SMILESCCOC(=O)c1cnccc1Nc1nc(ncc1Oc1ccccc1C(=O)OCC)-c1nn(Cc2ccccc2F)c2CCCc12