Reaction Details
TargeteIF-2-alpha kinase GCN2
LigandBDBM50011232
Substrate/Competitorn/a
Meas. Tech.ChEMBL_1351816 (CHEMBL3271322)
IC50<300±n/a nM
Citation Brazeau, JFRosse, G Triazolo[4,5-d]pyrimidine Derivatives as Inhibitors of GCN2. ACS Med Chem Lett5:282-3 (2014) 
 
eIF-2-alpha kinase GCN2
Name:eIF-2-alpha kinase GCN2
Type:PROTEIN
Mol. Mass.:186899.26
Organism:Homo sapiens (Human)
Description:ChEMBL_1495738
Residue:1649
BDBM50011232
NameBDBM50011232
Synonyms:CHEMBL3260332
TypeSmall organic molecule
Emp. Form.C23H29N9O
Mol. Mass.447.5361
SMILESCCOc1ccc(cc1)-n1nnc2nc(Nc3ccn(CCCC4CCNCC4)n3)ncc12