Reaction Details
TargeteIF-2-alpha kinase GCN2
LigandBDBM50011235
Substrate/Competitorn/a
Meas. Tech.ChEMBL_1351816 (CHEMBL3271322)
IC50 300±n/a nM
Citation Brazeau, JFRosse, G Triazolo[4,5-d]pyrimidine Derivatives as Inhibitors of GCN2. ACS Med Chem Lett5:282-3 (2014) 
 
eIF-2-alpha kinase GCN2
Name:eIF-2-alpha kinase GCN2
Type:PROTEIN
Mol. Mass.:186899.26
Organism:Homo sapiens (Human)
Description:ChEMBL_1495738
Residue:1649
BDBM50011235
NameBDBM50011235
Synonyms:CHEMBL3260333
TypeSmall organic molecule
Emp. Form.C20H24N8O2
Mol. Mass.408.457
SMILESCCn1ccc(Nc2ncc3n(nnc3n2)-c2ccc(cc2)C(C)(C)OCCO)n1