Reaction Details
Target5-hydroxytryptamine receptor 7
LigandBDBM50011237
Substrate/Competitorn/a
Meas. Tech.ChEMBL_1351817 (CHEMBL3271323)
Ki 12±n/a nM
Citation Abdel-Magid, AF Selective 5-HT Receptor Modulators May Deliver Focused Targeting with Fewer Adverse Effects. ACS Med Chem Lett5:284-5 (2014) 
 
5-hydroxytryptamine receptor 7
Name:5-hydroxytryptamine receptor 7
Type:G Protein-Coupled Receptor (GPCR)
Mol. Mass.:49852.62
Organism:Rattus norvegicus (rat)
Description:Rat cloned 5-HT7R.
Residue:448
BDBM50011237
NameBDBM50011237
Synonyms:CHEMBL3260334 | US9981909, Example 2
TypeSmall organic molecule
Emp. Form.C16H15BrClNO2
Mol. Mass.368.653
SMILESClc1cccc(COc2ccc(Br)cc2OC2CNC2)c1