Reaction Details
TargetPlasma kallikrein
LigandBDBM50011254
Substrate/Competitorn/a
Meas. Tech.ChEMBL_1351826 (CHEMBL3271332)
Ki 2.4±n/a nM
Citation Abdel-Magid, AF Inhibitors of Factor XIa and Plasma Kallikrein May Treat Thromboembolic Disorders and Many Diabetes Complications. ACS Med Chem Lett5:286-7 (2014) 
 
Plasma kallikrein
Name:Plasma kallikrein
Type:Protein
Mol. Mass.:71391.16
Organism:Homo sapiens (Human)
Description:P03952
Residue:638
BDBM50011254
NameBDBM50011254
Synonyms:CHEMBL3260342
TypeSmall organic molecule
Emp. Form.C30H25ClF2N4O4
Mol. Mass.578.994
SMILESCOC(=O)Nc1ccc-2c(NC(=O)CCCC[C@@H](c3cc-2ccn3)n2ccc(cc2=O)-c2c(F)ccc(Cl)c2F)c1