Reaction Details
TargetAdenosine receptor A2a
LigandBDBM50382498
Substrate/Competitorn/a
Meas. Tech.ChEMBL_1352083 (CHEMBL3267348)
Ki 3.5±n/a nM
Citation de Lera Ruiz, MLim, YHZheng, J Adenosine A2A receptor as a drug discovery target. J Med Chem57:3623-50 (2014) 
 
Adenosine receptor A2a
Name:Adenosine receptor A2a
Type:G Protein-Coupled Receptor (GPCR)
Mol. Mass.:44716.46
Organism:Homo sapiens (Human)
Description:P29274
Residue:412
BDBM50382498
NameBDBM50382498
Synonyms:CHEMBL2024119 | US10988455, Example 1(ccix)
TypeSmall organic molecule
Emp. Form.C16H12F3N5
Mol. Mass.331.2952
SMILESCc1cc(cc(n1)C(F)(F)F)-c1nnc(N)nc1-c1ccccc1