Reaction Details
TargetAdenosine receptor A1
LigandBDBM50202773
Substrate/Competitorn/a
Meas. Tech.ChEMBL_1352084 (CHEMBL3267349)
Ki 602±n/a nM
Citation de Lera Ruiz, MLim, YHZheng, J Adenosine A2A receptor as a drug discovery target. J Med Chem57:3623-50 (2014) 
 
Adenosine receptor A1
Name:Adenosine receptor A1
Type:G Protein-Coupled Receptor (GPCR)
Mol. Mass.:36520.92
Organism:Homo sapiens (Human)
Description:P30542
Residue:326
BDBM50202773
NameBDBM50202773
Synonyms:8-(furan-2-yl)-3-(2-(4-(4-(2-methoxyethoxy)phenyl)piperazin-1-yl)ethyl)-3H-[1,2,4]triazolo[1,5-g]purin-5-amine | CHEMBL395472
TypeSmall organic molecule
Emp. Form.C25H29N9O3
Mol. Mass.503.5563
SMILESCOCCOc1ccc(cc1)N1CCN(CCn2cnc3c2nc(N)n2nc(nc32)-c2ccco2)CC1