Reaction Details
TargetAdenosine receptor A2a
LigandBDBM50316894
Substrate/Competitorn/a
Meas. Tech.ChEMBL_1352082 (CHEMBL3267347)
Ki 4.4±n/a nM
Citation de Lera Ruiz, MLim, YHZheng, J Adenosine A2A receptor as a drug discovery target. J Med Chem57:3623-50 (2014) 
 
Adenosine receptor A2a
Name:Adenosine receptor A2a
Type:G Protein-Coupled Receptor (GPCR)
Mol. Mass.:44716.46
Organism:Homo sapiens (Human)
Description:P29274
Residue:412
BDBM50316894
NameBDBM50316894
Synonyms:2-amino-8-(2-morpholinoethylamino)-4-phenyl-5H-indeno[1,2-d]pyrimidin-5-one | CHEMBL1095172
TypeSmall organic molecule
Emp. Form.C23H23N5O2
Mol. Mass.401.461
SMILESNc1nc2-c3cc(NCCN4CCOCC4)ccc3C(=O)c2c(n1)-c1ccccc1