Reaction Details
TargetAdenosine receptor A2a
LigandBDBM50084860
Substrate/Competitorn/a
Meas. Tech.ChEMBL_1352091 (CHEMBL3267356)
Ki 5.0±n/a nM
Citation de Lera Ruiz, MLim, YHZheng, J Adenosine A2A receptor as a drug discovery target. J Med Chem57:3623-50 (2014) 
 
Adenosine receptor A2a
Name:Adenosine receptor A2a
Type:G Protein-Coupled Receptor (GPCR)
Mol. Mass.:45015.65
Organism:Rattus norvegicus (rat)
Description:Rat A2A receptors expressed in CHO cells.
Residue:410
BDBM50084860
NameBDBM50084860
Synonyms:3-(3-Hydroxy-propyl)-8-[2-(3-methoxy-phenyl)-vinyl]-7-methyl-1-prop-2-ynyl-3,7-dihydro-purine-2,6-dione(MSX-2) | CHEMBL413079
TypeSmall organic molecule
Emp. Form.C21H22N4O4
Mol. Mass.394.4238
SMILESCOc1cccc(\C=C\c2nc3n(CCCO)c(=O)n(CC#C)c(=O)c3n2C)c1