Reaction Details
TargetAdenosine receptor A1
LigandBDBM50364063
Substrate/Competitorn/a
Meas. Tech.ChEMBL_1352075 (CHEMBL3267340)
Ki 77±n/a nM
Citation de Lera Ruiz, MLim, YHZheng, J Adenosine A2A receptor as a drug discovery target. J Med Chem57:3623-50 (2014) 
 
Adenosine receptor A1
Name:Adenosine receptor A1
Type:G Protein-Coupled Receptor (GPCR)
Mol. Mass.:36520.92
Organism:Homo sapiens (Human)
Description:P30542
Residue:326
BDBM50364063
NameBDBM50364063
Synonyms:CHEMBL1950649
TypeSmall organic molecule
Emp. Form.C23H30N6O6
Mol. Mass.486.5209
SMILESCCNC(=O)[C@H]1O[C@H]([C@H](O)[C@@H]1O)n1cnc2c(N)nc(nc12)C#CC[C@H]1CC[C@@H](CC1)C(=O)OC