Reaction Details
TargetCannabinoid receptor 1
LigandBDBM50011306
Substrate/Competitorn/a
Meas. Tech.ChEMBL_1352142 (CHEMBL3267751)
Ki 210±n/a nM
Citation Ellsworth, BASher, PMWu, XWu, GSulsky, RBGu, ZMurugesan, NZhu, YYu, GSitkoff, DFCarlson, KEKang, LYang, YLee, NBaska, RAKeim, WJCullen, MJAzzara, AVZuvich, EThomas, MARohrbach, KWDevenny, JJGodonis, HEHarvey, SJMurphy, BJEverlof, GGStetsko, PIGudmundsson, OJohnghar, SRanasinghe, ABehnia, KPelleymounter, MAEwing, WR Reductions in log P improved protein binding and clearance predictions enabling the prospective design of cannabinoid receptor (CB1) antagonists with desired pharmacokinetic properties. J Med Chem56:9586-600 (2014) 
 
Cannabinoid receptor 1
Name:Cannabinoid receptor 1
Type:G Protein-Coupled Receptor (GPCR)
Mol. Mass.:52868.96
Organism:Homo sapiens (Human)
Description:P21554
Residue:472
BDBM50011306
NameBDBM50011306
Synonyms:CHEMBL3260733
TypeSmall organic molecule
Emp. Form.C24H16ClF3N6O
Mol. Mass.496.872
SMILESCc1nn2c(nn(Cc3ccc(nc3)C(F)(F)F)c2=O)c(-c2ccncc2)c1-c1ccc(Cl)cc1