Reaction Details
TargetCytochrome P450 2C19
LigandBDBM50011314
Substrate/Competitorn/a
Meas. Tech.ChEMBL_1352207 (CHEMBL3268563)
IC50 700±n/a nM
Citation Ellsworth, BASher, PMWu, XWu, GSulsky, RBGu, ZMurugesan, NZhu, YYu, GSitkoff, DFCarlson, KEKang, LYang, YLee, NBaska, RAKeim, WJCullen, MJAzzara, AVZuvich, EThomas, MARohrbach, KWDevenny, JJGodonis, HEHarvey, SJMurphy, BJEverlof, GGStetsko, PIGudmundsson, OJohnghar, SRanasinghe, ABehnia, KPelleymounter, MAEwing, WR Reductions in log P improved protein binding and clearance predictions enabling the prospective design of cannabinoid receptor (CB1) antagonists with desired pharmacokinetic properties. J Med Chem56:9586-600 (2014) 
 
Cytochrome P450 2C19
Name:Cytochrome P450 2C19
Type:Enzyme
Mol. Mass.:55935.47
Organism:Homo sapiens (Human)
Description:P33261
Residue:490
BDBM50011314
NameBDBM50011314
Synonyms:CHEMBL3260741
TypeSmall organic molecule
Emp. Form.C25H18ClF3N6O2
Mol. Mass.526.898
SMILESCc1nc(ccc1Cn1n2c(nn(C)c2=O)c(-c2ccc(Cl)cc2)c(-c2ccncc2)c1=O)C(F)(F)F