Reaction Details
TargetCytochrome P450 2C9
LigandBDBM50011333
Substrate/Competitorn/a
Meas. Tech.ChEMBL_1352208 (CHEMBL3268564)
IC50>40000±n/a nM
Citation Ellsworth, BASher, PMWu, XWu, GSulsky, RBGu, ZMurugesan, NZhu, YYu, GSitkoff, DFCarlson, KEKang, LYang, YLee, NBaska, RAKeim, WJCullen, MJAzzara, AVZuvich, EThomas, MARohrbach, KWDevenny, JJGodonis, HEHarvey, SJMurphy, BJEverlof, GGStetsko, PIGudmundsson, OJohnghar, SRanasinghe, ABehnia, KPelleymounter, MAEwing, WR Reductions in log P improved protein binding and clearance predictions enabling the prospective design of cannabinoid receptor (CB1) antagonists with desired pharmacokinetic properties. J Med Chem56:9586-600 (2014) 
 
Cytochrome P450 2C9
Name:Cytochrome P450 2C9
Type:Enzyme
Mol. Mass.:55636.33
Organism:Homo sapiens (Human)
Description:P11712
Residue:490
BDBM50011333
NameBDBM50011333
Synonyms:CHEMBL3260753
TypeSmall organic molecule
Emp. Form.C26H21ClF3N7O2
Mol. Mass.555.939
SMILESCCn1nc2c(-c3ccc(Cl)cc3)c(-c3cnc(C)nc3)c(=O)n(Cc3ccc(nc3C)C(F)(F)F)n2c1=O