Reaction Details
TargetMelatonin receptor type 1A
LigandBDBM85065
Substrate/Competitorn/a
Meas. Tech.ChEMBL_1352244 (CHEMBL3268962)
Ki 158±n/a nM
Citation Zlotos, DPJockers, RCecon, ERivara, SWitt-Enderby, PA MT1 and MT2 melatonin receptors: ligands, models, oligomers, and therapeutic potential. J Med Chem57:3161-85 (2014) 
 
Melatonin receptor type 1A
Name:Melatonin receptor type 1A
Type:Enzyme
Mol. Mass.:39392.94
Organism:Homo sapiens (Human)
Description:P48039
Residue:350
BDBM85065
NameBDBM85065
Synonyms:CAS_117946-91-5 NSC_122162
TypeSmall organic molecule
Emp. Form.C19H20N2O
Mol. Mass.292.3749
SMILESCC(=O)NCCc1c(Cc2ccccc2)[nH]c2ccccc12