Reaction Details
TargetRap guanine nucleotide exchange factor 3
LigandBDBM50011360
Substrate/Competitorn/a
Meas. Tech.ChEMBL_1352340 (CHEMBL3269757)
IC50 3200±n/a nM
Citation Chen, HWild, CZhou, XYe, NCheng, XZhou, J Recent advances in the discovery of small molecules targeting exchange proteins directly activated by cAMP (EPAC). J Med Chem57:3651-65 (2014) 
 
Rap guanine nucleotide exchange factor 3
Name:Rap guanine nucleotide exchange factor 3
Type:PROTEIN
Mol. Mass.:103769.52
Organism:Homo sapiens (Human)
Description:ChEMBL_104531
Residue:923
BDBM50011360
NameBDBM50011360
Synonyms:CHEMBL3260990
TypeSmall organic molecule
Emp. Form.C16H15ClN4O2
Mol. Mass.330.769
SMILESCC(C)(C)c1cc(no1)C(=O)C(=N\Nc1cccc(Cl)c1)\C#N