Reaction Details
TargetDipeptidyl peptidase 1
LigandBDBM50011506
Substrate/Competitorn/a
Meas. Tech.ChEMBL_1353219 (CHEMBL3266696)
IC50 4.0±n/a nM
Citation Furber, MTiden, AKGardiner, PMete, AFord, RMillichip, IStein, LMather, AKinchin, ELuckhurst, CBarber, SCage, PSanganee, HAustin, RChohan, KBeri, RThong, BWallace, AOreffo, VHutchinson, RHarper, SDebreczeni, JBreed, JWissler, LEdman, K Cathepsin C inhibitors: property optimization and identification of a clinical candidate. J Med Chem57:2357-67 (2014) 
 
Dipeptidyl peptidase 1
Name:Dipeptidyl peptidase 1
Type:Enzyme
Mol. Mass.:51857.28
Organism:Homo sapiens (Human)
Description:P53634
Residue:463
BDBM50011506
NameBDBM50011506
Synonyms:CHEMBL3261920
TypeSmall organic molecule
Emp. Form.C23H24N4OS
Mol. Mass.404.528
SMILESCSc1cc(ccc1C#N)-c1ccc(C[C@H](NC(=O)[C@@H]2CCCCN2)C#N)cc1