Reaction Details
TargetDipeptidyl peptidase 1
LigandBDBM50011503
Substrate/Competitorn/a
Meas. Tech.ChEMBL_1353219 (CHEMBL3266696)
IC50 0.794328±n/a nM
Citation Furber, MTiden, AKGardiner, PMete, AFord, RMillichip, IStein, LMather, AKinchin, ELuckhurst, CBarber, SCage, PSanganee, HAustin, RChohan, KBeri, RThong, BWallace, AOreffo, VHutchinson, RHarper, SDebreczeni, JBreed, JWissler, LEdman, K Cathepsin C inhibitors: property optimization and identification of a clinical candidate. J Med Chem57:2357-67 (2014) 
 
Dipeptidyl peptidase 1
Name:Dipeptidyl peptidase 1
Type:Enzyme
Mol. Mass.:51857.28
Organism:Homo sapiens (Human)
Description:P53634
Residue:463
BDBM50011503
NameBDBM50011503
Synonyms:CHEMBL3261927
TypeSmall organic molecule
Emp. Form.C22H25N3O4S
Mol. Mass.427.517
SMILESCS(=O)(=O)c1cccc(c1)-c1ccc(C[C@H](NC(=O)C2(N)CCOCC2)C#N)cc1