Reaction Details
TargetMu-type opioid receptor
LigandBDBM50011517
Substrate/Competitorn/a
Meas. Tech.ChEMBL_1351169 (CHEMBL3270912)
Ki 10±n/a nM
Citation Journigan, VBPolgar, WEKhroyan, TVZaveri, NT Designing bifunctional NOP receptor-mu opioid receptor ligands from NOP-receptor selective scaffolds. Part II. Bioorg Med Chem22:2508-16 (2014) 
 
Mu-type opioid receptor
Name:Mu-type opioid receptor
Type:G Protein-Coupled Receptor (GPCR)
Mol. Mass.:44789.51
Organism:Homo sapiens (Human)
Description:P35372
Residue:400
BDBM50011517
NameBDBM50011517
Synonyms:CHEMBL3262547
TypeSmall organic molecule
Emp. Form.C25H30N2O
Mol. Mass.374.5185
SMILESCCC1C(=O)N(C2CCN(CC2)C2CCc3ccccc3C2)c2ccccc12