Reaction Details
TargetKappa-type opioid receptor
LigandBDBM50011522
Substrate/Competitorn/a
Meas. Tech.ChEMBL_1351170 (CHEMBL3270913)
Ki 1367±n/a nM
Citation Journigan, VBPolgar, WEKhroyan, TVZaveri, NT Designing bifunctional NOP receptor-mu opioid receptor ligands from NOP-receptor selective scaffolds. Part II. Bioorg Med Chem22:2508-16 (2014) 
 
Kappa-type opioid receptor
Name:Kappa-type opioid receptor
Type:G Protein-Coupled Receptor (GPCR)
Mol. Mass.:42648.76
Organism:Homo sapiens (Human)
Description:P41145
Residue:380
BDBM50011522
NameBDBM50011522
Synonyms:CHEMBL3262552
TypeSmall organic molecule
Emp. Form.C24H28N2O
Mol. Mass.360.4919
SMILESCCC1C(=O)N(C2CCN(C\C=C\c3ccccc3)CC2)c2ccccc12