Reaction Details
TargetNociceptin receptor
LigandBDBM50011518
Substrate/Competitorn/a
Meas. Tech.ChEMBL_1351171 (CHEMBL3270914)
EC50 82±n/a nM
Citation Journigan, VBPolgar, WEKhroyan, TVZaveri, NT Designing bifunctional NOP receptor-mu opioid receptor ligands from NOP-receptor selective scaffolds. Part II. Bioorg Med Chem22:2508-16 (2014) 
 
Nociceptin receptor
Name:Nociceptin receptor
Type:G Protein-Coupled Receptor (GPCR)
Mol. Mass.:40702.87
Organism:Homo sapiens (Human)
Description:P41146
Residue:370
BDBM50011518
NameBDBM50011518
Synonyms:CHEMBL3262548
TypeSmall organic molecule
Emp. Form.C24H27N3O
Mol. Mass.373.4907
SMILESCCC1C(=O)N(C2CCN(Cc3cccc4[nH]ccc34)CC2)c2ccccc12