Reaction Details
TargetMu-type opioid receptor
LigandBDBM50011519
Substrate/Competitorn/a
Meas. Tech.ChEMBL_1351172 (CHEMBL3270915)
EC50 40±n/a nM
Citation Journigan, VBPolgar, WEKhroyan, TVZaveri, NT Designing bifunctional NOP receptor-mu opioid receptor ligands from NOP-receptor selective scaffolds. Part II. Bioorg Med Chem22:2508-16 (2014) 
 
Mu-type opioid receptor
Name:Mu-type opioid receptor
Type:G Protein-Coupled Receptor (GPCR)
Mol. Mass.:44789.51
Organism:Homo sapiens (Human)
Description:P35372
Residue:400
BDBM50011519
NameBDBM50011519
Synonyms:CHEMBL3262549
TypeSmall organic molecule
Emp. Form.C30H34N2O
Mol. Mass.438.6038
SMILESCCC1C(=O)N(C2CCN(CCC(c3ccccc3)c3ccccc3)CC2)c2ccccc12