Reaction Details
TargetMu-type opioid receptor
LigandBDBM50011521
Substrate/Competitorn/a
Meas. Tech.ChEMBL_1351172 (CHEMBL3270915)
EC50 673±n/a nM
Citation Journigan, VBPolgar, WEKhroyan, TVZaveri, NT Designing bifunctional NOP receptor-mu opioid receptor ligands from NOP-receptor selective scaffolds. Part II. Bioorg Med Chem22:2508-16 (2014) 
 
Mu-type opioid receptor
Name:Mu-type opioid receptor
Type:G Protein-Coupled Receptor (GPCR)
Mol. Mass.:44789.51
Organism:Homo sapiens (Human)
Description:P35372
Residue:400
BDBM50011521
NameBDBM50011521
Synonyms:CHEMBL3262551
TypeSmall organic molecule
Emp. Form.C24H30N2O
Mol. Mass.362.5078
SMILESCCC1C(=O)N(C2CCN(CCCc3ccccc3)CC2)c2ccccc12