Reaction Details
TargetMitogen-activated protein kinase kinase kinase kinase 4
LigandBDBM50011548
Substrate/Competitorn/a
Meas. Tech.ChEMBL_1351266 (CHEMBL3265751)
Kd 68000±n/a nM
Citation Crawford, TDNdubaku, COChen, HBoggs, JWBravo, BJDelatorre, KGiannetti, AMGould, SEHarris, SFMagnuson, SRMcNamara, EMurray, LJNonomiya, JSambrone, ASchmidt, SSmyczek, TStanley, MVitorino, PWang, LWest, KWu, PYe, W Discovery of selective 4-Amino-pyridopyrimidine inhibitors of MAP4K4 using fragment-based lead identification and optimization. J Med Chem57:3484-93 (2014) 
 
Mitogen-activated protein kinase kinase kinase kinase 4
Name:Mitogen-activated protein kinase kinase kinase kinase 4
Type:Serine/threonine-protein kinase
Mol. Mass.:142114.73
Organism:Homo sapiens (Human)
Description:O95819
Residue:1239
BDBM50011548
NameBDBM50011548
Synonyms:CHEMBL3262567
TypeSmall organic molecule
Emp. Form.C12H13N3
Mol. Mass.199.2517
SMILESCc1cc(cnc1N)-c1cccc(N)c1