Reaction Details
TargetMitogen-activated protein kinase kinase kinase kinase 4
LigandBDBM50011560
Substrate/Competitorn/a
Meas. Tech.ChEMBL_1351267 (CHEMBL3265752)
IC50 60±n/a nM
Citation Crawford, TDNdubaku, COChen, HBoggs, JWBravo, BJDelatorre, KGiannetti, AMGould, SEHarris, SFMagnuson, SRMcNamara, EMurray, LJNonomiya, JSambrone, ASchmidt, SSmyczek, TStanley, MVitorino, PWang, LWest, KWu, PYe, W Discovery of selective 4-Amino-pyridopyrimidine inhibitors of MAP4K4 using fragment-based lead identification and optimization. J Med Chem57:3484-93 (2014) 
 
Mitogen-activated protein kinase kinase kinase kinase 4
Name:Mitogen-activated protein kinase kinase kinase kinase 4
Type:Serine/threonine-protein kinase
Mol. Mass.:142114.73
Organism:Homo sapiens (Human)
Description:O95819
Residue:1239
BDBM50011560
NameBDBM50011560
Synonyms:CHEMBL3262579 US9855269, Compound 31
TypeSmall organic molecule
Emp. Form.C14H11FN4
Mol. Mass.254.2623
SMILESNc1cc(F)cc(c1)-c1ccc2ncnc(N)c2c1