Reaction Details
TargetRAF proto-oncogene serine/threonine-protein kinase
LigandBDBM16673
Substrate/Competitorn/a
Meas. Tech.ChEMBL_1351306 (CHEMBL3266155)
IC50 22±n/a nM
Citation Lu, CTang, KLi, YLi, PLin, ZYin, DChen, XHuang, H Design, synthesis and evaluation of novel diaryl urea derivatives as potential antitumor agents. Eur J Med Chem77:351-60 (2014) 
 
RAF proto-oncogene serine/threonine-protein kinase
Name:RAF proto-oncogene serine/threonine-protein kinase
Type:Serine/threonine-protein kinase
Mol. Mass.:73082.52
Organism:Homo sapiens (Human)
Description:P04049
Residue:648
BDBM16673
NameBDBM16673
Synonyms:4-[4-({[4-chloro-3-(trifluoromethyl)phenyl]carbamoyl}amino)phenoxy]-N-methylpyridine-2-carboxamide BAY 43-9006 BAY439006 Hit compound, 8 Sorafenib US10183928, Sorafenib US10227329, Compound Sorafenib US10774070, Compound Sorafenib US11279688, Compound Sorafenib US9029401, Sorafenib US9902709, Comparative example 1 cid_216239
TypeSmall organic molecule
Emp. Form.C21H16ClF3N4O3
Mol. Mass.464.825
SMILESCNC(=O)c1cc(Oc2ccc(NC(=O)Nc3ccc(Cl)c(c3)C(F)(F)F)cc2)ccn1