Reaction Details
TargetG-protein coupled receptor 183
LigandBDBM50011720
Substrate/Competitorn/a
Meas. Tech.ChEMBL_1351308 (CHEMBL3266157)
IC50 2951±n/a nM
Citation Gessier, FPreuss, IYin, HRosenkilde, MMLaurent, SEndres, RChen, YAMarsilje, THSeuwen, KNguyen, DGSailer, AW Identification and characterization of small molecule modulators of the Epstein-Barr virus-induced gene 2 (EBI2) receptor. J Med Chem57:3358-68 (2014) 
 
G-protein coupled receptor 183
Name:G-protein coupled receptor 183
Type:PROTEIN
Mol. Mass.:41245.79
Organism:Homo sapiens (Human)
Description:ChEMBL_108311
Residue:361
BDBM50011720
NameBDBM50011720
Synonyms:CHEMBL3262878
TypeSmall organic molecule
Emp. Form.C22H26N2O3
Mol. Mass.366.4534
SMILESCc1ccc(OCC(=O)N2CCN(CC2)C(=O)Cc2ccccc2)cc1C