Reaction Details
TargetG-protein coupled receptor 183
LigandBDBM50011727
Substrate/Competitorn/a
Meas. Tech.ChEMBL_1351308 (CHEMBL3266157)
IC50 98±n/a nM
Citation Gessier, FPreuss, IYin, HRosenkilde, MMLaurent, SEndres, RChen, YAMarsilje, THSeuwen, KNguyen, DGSailer, AW Identification and characterization of small molecule modulators of the Epstein-Barr virus-induced gene 2 (EBI2) receptor. J Med Chem57:3358-68 (2014) 
 
G-protein coupled receptor 183
Name:G-protein coupled receptor 183
Type:PROTEIN
Mol. Mass.:41245.79
Organism:Homo sapiens (Human)
Description:ChEMBL_108311
Residue:361
BDBM50011727
NameBDBM50011727
Synonyms:CHEMBL3262885
TypeSmall organic molecule
Emp. Form.C22H21F3N2O3
Mol. Mass.418.4089
SMILESCOc1ccc(\C=C\C(=O)N2CCN(CC2)C(=O)c2ccc(cc2)C(F)(F)F)cc1