Reaction Details
TargetG-protein coupled receptor 183
LigandBDBM50011716
Substrate/Competitorn/a
Meas. Tech.ChEMBL_1352279 (CHEMBL3268997)
IC50 8.5±n/a nM
Citation Gessier, FPreuss, IYin, HRosenkilde, MMLaurent, SEndres, RChen, YAMarsilje, THSeuwen, KNguyen, DGSailer, AW Identification and characterization of small molecule modulators of the Epstein-Barr virus-induced gene 2 (EBI2) receptor. J Med Chem57:3358-68 (2014) 
 
G-protein coupled receptor 183
Name:G-protein coupled receptor 183
Type:PROTEIN
Mol. Mass.:41245.79
Organism:Homo sapiens (Human)
Description:ChEMBL_108311
Residue:361
BDBM50011716
NameBDBM50011716
Synonyms:CHEMBL3262896
TypeSmall organic molecule
Emp. Form.C21H21BrN2O3
Mol. Mass.429.307
SMILESCOc1ccc(cc1)C(=O)N1CCN(CC1)C(=O)\C=C\c1ccc(Br)cc1