Reaction Details
TargetG-protein coupled receptor 183
LigandBDBM50011578
Substrate/Competitorn/a
Meas. Tech.ChEMBL_1351309 (CHEMBL3266158)
IC50 18±n/a nM
Citation Gessier, FPreuss, IYin, HRosenkilde, MMLaurent, SEndres, RChen, YAMarsilje, THSeuwen, KNguyen, DGSailer, AW Identification and characterization of small molecule modulators of the Epstein-Barr virus-induced gene 2 (EBI2) receptor. J Med Chem57:3358-68 (2014) 
 
G-protein coupled receptor 183
Name:G-protein coupled receptor 183
Type:PROTEIN
Mol. Mass.:40205.57
Organism:Mus musculus
Description:ChEMBL_108312
Residue:357
BDBM50011578
NameBDBM50011578
Synonyms:CHEMBL3262890
TypeSmall organic molecule
Emp. Form.C23H24N2O5
Mol. Mass.408.4471
SMILESCOC(=O)c1ccc(cc1)C(=O)N1CCN(CC1)C(=O)\C=C\c1ccc(OC)cc1