Reaction Details
TargetPolyunsaturated fatty acid lipoxygenase ALOX15B
LigandBDBM50011783
Substrate/Competitorn/a
Meas. Tech.ChEMBL_1352304 (CHEMBL3269368)
IC50>50000±n/a nM
Citation Rai, GJoshi, NJung, JELiu, YSchultz, LYasgar, APerry, SDiaz, GZhang, QKenyon, VJadhav, ASimeonov, ALo, EHvan Leyen, KMaloney, DJHolman, TR Potent and selective inhibitors of human reticulocyte 12/15-lipoxygenase as anti-stroke therapies. J Med Chem57:4035-48 (2014) 
 
Polyunsaturated fatty acid lipoxygenase ALOX15B
Name:Polyunsaturated fatty acid lipoxygenase ALOX15B
Type:Protein
Mol. Mass.:75850.40
Organism:Homo sapiens (Human)
Description:n/a
Residue:676
BDBM50011783
NameBDBM50011783
Synonyms:CHEMBL3262925
TypeSmall organic molecule
Emp. Form.C15H11N3S
Mol. Mass.265.333
SMILESCNc1sc(nc1C#N)-c1cccc2ccccc12