Reaction Details
TargetTyrosine-protein kinase BTK
LigandBDBM50012060
Substrate/Competitorn/a
Meas. Tech.ChEMBL_1352461 (CHEMBL3270982)
IC50 112±n/a nM
Citation Shi, QTebben, ADyckman, AJLi, HLiu, CLin, JSpergel, SBurke, JRMcIntyre, KWOlini, GCStrnad, JSurti, NMuckelbauer, JKChang, CAn, YCheng, LRuan, QLeftheris, KCarter, PHTino, JDe Lucca, GV Purine derivatives as potent Bruton's tyrosine kinase (BTK) inhibitors for autoimmune diseases. Bioorg Med Chem Lett24:2206-11 (2014) 
 
Tyrosine-protein kinase BTK
Name:Tyrosine-protein kinase BTK
Type:PROTEIN
Mol. Mass.:76447.19
Organism:Mus musculus
Description:ChEMBL_108319
Residue:659
BDBM50012060
NameBDBM50012060
Synonyms:CHEMBL3263640
TypeSmall organic molecule
Emp. Form.C34H35N7O3
Mol. Mass.589.6868
SMILESCc1c(NC(=O)c2ccc(cc2)C(C)(C)C)cccc1-c1nc(Nc2ccc(cc2)C(=O)N2CCOCC2)c2nc[nH]c2n1