Reaction Details
TargetKappa-type opioid receptor
LigandBDBM71567
Substrate/Competitorn/a
Meas. Tech.ChEMBL_1352795 (CHEMBL3268195)
IC50 2930±n/a nM
Citation Urbano, MGuerrero, MRosen, HRoberts, E Antagonists of the kappa opioid receptor. Bioorg Med Chem Lett24:2021-32 (2014) 
 
Kappa-type opioid receptor
Name:Kappa-type opioid receptor
Type:G Protein-Coupled Receptor (GPCR)
Mol. Mass.:42648.76
Organism:Homo sapiens (Human)
Description:P41145
Residue:380
BDBM71567
NameBDBM71567
Synonyms:KSC-11-23-1 N-[2-[benzyl(ethyl)amino]ethyl]-4-[(tosylamino)methyl]benzamide N-[2-[ethyl-(phenylmethyl)amino]ethyl]-4-[[(4-methylphenyl)sulfonylamino]methyl]benzamide | cid_44608034
TypeSmall organic molecule
Emp. Form.C26H31N3O3S
Mol. Mass.465.608
SMILESCCN(CCNC(=O)c1ccc(CNS(=O)(=O)c2ccc(C)cc2)cc1)Cc1ccccc1