Reaction Details
TargetKappa-type opioid receptor
LigandBDBM50012148
Substrate/Competitorn/a
Meas. Tech.ChEMBL_1352780 (CHEMBL3268180)
IC50 376±n/a nM
Citation Urbano, MGuerrero, MRosen, HRoberts, E Antagonists of the kappa opioid receptor. Bioorg Med Chem Lett24:2021-32 (2014) 
 
Kappa-type opioid receptor
Name:Kappa-type opioid receptor
Type:G Protein-Coupled Receptor (GPCR)
Mol. Mass.:42648.76
Organism:Homo sapiens (Human)
Description:P41145
Residue:380
BDBM50012148
NameBDBM50012148
Synonyms:CHEMBL3183148
TypeSmall organic molecule
Emp. Form.C22H33N3O5
Mol. Mass.419.5145
SMILESCCOC(=O)c1cc(C(=O)OC)c(C)nc1N1CCC(CC1)NC1CCCCC1O