Reaction Details
TargetKappa-type opioid receptor
LigandBDBM50012152
Substrate/Competitorn/a
Meas. Tech.ChEMBL_1352783 (CHEMBL3268183)
Ki 1.7±n/a nM
Citation Urbano, MGuerrero, MRosen, HRoberts, E Antagonists of the kappa opioid receptor. Bioorg Med Chem Lett24:2021-32 (2014) 
 
Kappa-type opioid receptor
Name:Kappa-type opioid receptor
Type:G Protein-Coupled Receptor (GPCR)
Mol. Mass.:42648.76
Organism:Homo sapiens (Human)
Description:P41145
Residue:380
BDBM50012152
NameBDBM50012152
Synonyms:CHEMBL3264441
TypeSmall organic molecule
Emp. Form.C28H36N2O6
Mol. Mass.496.5952
SMILESCCOC(=O)C(CN1CC[C@](C)([C@@H](C)C1)c1cccc(O)c1)OC(=O)[C@H]1Cc2ccc(O)cc2CN1