Reaction Details
TargetDelta-type opioid receptor
LigandBDBM71581
Substrate/Competitorn/a
Meas. Tech.ChEMBL_1352796 (CHEMBL3268196)
IC50>32000±n/a nM
Citation Urbano, MGuerrero, MRosen, HRoberts, E Antagonists of the kappa opioid receptor. Bioorg Med Chem Lett24:2021-32 (2014) 
 
Delta-type opioid receptor
Name:Delta-type opioid receptor
Type:G Protein-Coupled Receptor (GPCR)
Mol. Mass.:40382.98
Organism:Homo sapiens (Human)
Description:Competition binding assays were carried out using membrane preparations from transfected HN9.10 cells that constitutively expressed the delta opioid receptor.
Residue:372
BDBM71581
NameBDBM71581
Synonyms:KSC-5-280C N-[2-[(4-bromobenzyl)-isopropyl-amino]ethyl]-4-[(tosylamino)methyl]benzamide N-[2-[(4-bromophenyl)methyl-propan-2-ylamino]ethyl]-4-[[(4-methylphenyl)sulfonylamino]methyl]benzamide | cid_44620907
TypeSmall organic molecule
Emp. Form.C27H32BrN3O3S
Mol. Mass.558.53
SMILESCC(C)N(CCNC(=O)c1ccc(CNS(=O)(=O)c2ccc(C)cc2)cc1)Cc1ccc(Br)cc1