Reaction Details
TargetDelta-type opioid receptor
LigandBDBM71611
Substrate/Competitorn/a
Meas. Tech.ChEMBL_1352796 (CHEMBL3268196)
IC50>32000±n/a nM
Citation Urbano, MGuerrero, MRosen, HRoberts, E Antagonists of the kappa opioid receptor. Bioorg Med Chem Lett24:2021-32 (2014) 
 
Delta-type opioid receptor
Name:Delta-type opioid receptor
Type:G Protein-Coupled Receptor (GPCR)
Mol. Mass.:40382.98
Organism:Homo sapiens (Human)
Description:Competition binding assays were carried out using membrane preparations from transfected HN9.10 cells that constitutively expressed the delta opioid receptor.
Residue:372
BDBM71611
NameBDBM71611
Synonyms:KSC-1-261 cid_44665687
TypeSmall organic molecule
Emp. Form.C26H29ClN6O2
Mol. Mass.493
SMILESCc1ccnc2n(CC(=O)NCCCN3CCN(CC3)c3ccc(Cl)cc3)c(=O)c3cccn3c12