Reaction Details
TargetHistamine H1 receptor
LigandBDBM71610
Substrate/Competitorn/a
Meas. Tech.ChEMBL_1352899 (CHEMBL3269416)
Ki<1000±n/a nM
Citation Urbano, MGuerrero, MRosen, HRoberts, E Antagonists of the kappa opioid receptor. Bioorg Med Chem Lett24:2021-32 (2014) 
 
Histamine H1 receptor
Name:Histamine H1 receptor
Type:G Protein-Coupled Receptor (GPCR)
Mol. Mass.:55808.72
Organism:Homo sapiens (Human)
Description:Cell pellets from SK-N-MC cells transfected with human H1 receptor were used in binding assay.
Residue:487
BDBM71610
NameBDBM71610
Synonyms:KSC-1-256 ML190 | cid_44665680
TypeSmall organic molecule
Emp. Form.C27H32N6O3
Mol. Mass.488.5814
SMILESCOc1ccc(cc1)N1CCN(CCCNC(=O)Cn2c3nccc(C)c3n3cccc3c2=O)CC1