Reaction Details
TargetMuscarinic acetylcholine receptor M3
LigandBDBM54817
Substrate/Competitorn/a
Meas. Tech.ChEMBL_1352902 (CHEMBL3269419)
Ki<1000±n/a nM
Citation Urbano, MGuerrero, MRosen, HRoberts, E Antagonists of the kappa opioid receptor. Bioorg Med Chem Lett24:2021-32 (2014) 
 
Muscarinic acetylcholine receptor M3
Name:Muscarinic acetylcholine receptor M3
Type:Enzyme
Mol. Mass.:66151.03
Organism:Homo sapiens (Human)
Description:P20309
Residue:590
BDBM54817
NameBDBM54817
Synonyms:4-[[(4-methylphenyl)sulfonylamino]methyl]-N-[2-[(phenylmethyl)-propan-2-yl-amino]ethyl]benzamide MLS000682490 N-[2-[benzyl(propan-2-yl)amino]ethyl]-4-[[(4-methylphenyl)sulfonylamino]methyl]benzamide SMR000314971 | cid_3342390
TypeSmall organic molecule
Emp. Form.C27H33N3O3S
Mol. Mass.479.634
SMILESCC(C)N(CCNC(=O)c1ccc(CNS(=O)(=O)c2ccc(C)cc2)cc1)Cc1ccccc1