Reaction Details
TargetSigma non-opioid intracellular receptor 1
LigandBDBM75566
Substrate/Competitorn/a
Meas. Tech.ChEMBL_1352905 (CHEMBL3269422)
Ki<1000±n/a nM
Citation Urbano, MGuerrero, MRosen, HRoberts, E Antagonists of the kappa opioid receptor. Bioorg Med Chem Lett24:2021-32 (2014) 
 
Sigma non-opioid intracellular receptor 1
Name:Sigma non-opioid intracellular receptor 1
Type:Enzyme Catalytic Domain
Mol. Mass.:25124.85
Organism:Homo sapiens (Human)
Description:Q99720
Residue:223
BDBM75566
NameBDBM75566
Synonyms:KSC-11-114-1 N-[2-[benzyl(tert-butyl)amino]ethyl]-4-[(tosylamino)methyl]benzamide N-[2-[tert-butyl-(phenylmethyl)amino]ethyl]-4-[[(4-methylphenyl)sulfonylamino]methyl]benzamide | cid_45115589
TypeSmall organic molecule
Emp. Form.C28H35N3O3S
Mol. Mass.493.661
SMILESCc1ccc(cc1)S(=O)(=O)NCc1ccc(cc1)C(=O)NCCN(Cc1ccccc1)C(C)(C)C