Reaction Details
TargetPotassium voltage-gated channel subfamily H member 2
LigandBDBM50350976
Substrate/Competitorn/a
Meas. Tech.ChEMBL_1352925 (CHEMBL3269792)
IC50 2400±n/a nM
Citation Urbano, MGuerrero, MRosen, HRoberts, E Antagonists of the kappa opioid receptor. Bioorg Med Chem Lett24:2021-32 (2014) 
 
Potassium voltage-gated channel subfamily H member 2
Name:Potassium voltage-gated channel subfamily H member 2
Type:Multi-pass membrane protein
Mol. Mass.:126672.65
Organism:Homo sapiens (Human)
Description:Q12809
Residue:1159
BDBM50350976
NameBDBM50350976
Synonyms:CHEMBL1818341
TypeSmall organic molecule
Emp. Form.C21H28N2O2S
Mol. Mass.372.524
SMILESCC(C)CNCc1ccc(cc1)-c1ccccc1S(=O)(=O)N1CCCC1