Reaction Details
TargetDelta-type opioid receptor
LigandBDBM50012151
Substrate/Competitorn/a
Meas. Tech.ChEMBL_1352785 (CHEMBL3268185)
Ki 221±n/a nM
Citation Urbano, MGuerrero, MRosen, HRoberts, E Antagonists of the kappa opioid receptor. Bioorg Med Chem Lett24:2021-32 (2014) 
 
Delta-type opioid receptor
Name:Delta-type opioid receptor
Type:G Protein-Coupled Receptor (GPCR)
Mol. Mass.:40382.98
Organism:Homo sapiens (Human)
Description:Competition binding assays were carried out using membrane preparations from transfected HN9.10 cells that constitutively expressed the delta opioid receptor.
Residue:372
BDBM50012151
NameBDBM50012151
Synonyms:CHEMBL3264440
TypeSmall organic molecule
Emp. Form.C26H34N2O4
Mol. Mass.438.5592
SMILESC[C@H]1CN(CCCOC(=O)[C@H]2Cc3ccc(O)cc3CN2)CC[C@@]1(C)c1cccc(O)c1