Reaction Details
TargetMu-type opioid receptor
LigandBDBM50012155
Substrate/Competitorn/a
Meas. Tech.ChEMBL_1352790 (CHEMBL3268190)
EC50 130000±n/a nM
Citation Urbano, MGuerrero, MRosen, HRoberts, E Antagonists of the kappa opioid receptor. Bioorg Med Chem Lett24:2021-32 (2014) 
 
Mu-type opioid receptor
Name:Mu-type opioid receptor
Type:G Protein-Coupled Receptor (GPCR)
Mol. Mass.:44789.51
Organism:Homo sapiens (Human)
Description:P35372
Residue:400
BDBM50012155
NameBDBM50012155
Synonyms:CHEMBL3264442
TypeSmall organic molecule
Emp. Form.C28H38N2O
Mol. Mass.418.6141
SMILESCC1CN(CCCc2ccccc2)C2C[C@@H](CC1(C2)c1cccc(O)c1)NCC1CC1