Reaction Details
TargetFatty-acid amide hydrolase 1 [30-579]
LigandBDBM50012156
Substrate/Competitorn/a
Meas. Tech.ChEMBL_1352947 (CHEMBL3269814)
Ki 17.0±n/a nM
Citation Duncan, KKOtrubova, KBoger, DL a-Ketoheterocycle inhibitors of fatty acid amide hydrolase: exploration of conformational constraints in the acyl side chain. Bioorg Med Chem22:2763-70 (2014) 
 
Fatty-acid amide hydrolase 1 [30-579]
Name:Fatty-acid amide hydrolase 1 [30-579]
Type:Single-pass membrane protein; homodimer
Mol. Mass.:60474.00
Organism:Rattus norvegicus (rat)
Description:P97612 (aa 30-579)
Residue:550
BDBM50012156
NameBDBM50012156
Synonyms:CHEMBL3264460
TypeSmall organic molecule
Emp. Form.C19H15NO4
Mol. Mass.321.3267
SMILESO=C(C1CCc2cc(Oc3ccccc3)ccc2O1)c1ncco1