Reaction Details
TargetFatty-acid amide hydrolase 1 [30-579]
LigandBDBM50012162
Substrate/Competitorn/a
Meas. Tech.ChEMBL_1352947 (CHEMBL3269814)
Ki 23±n/a nM
Citation Duncan, KKOtrubova, KBoger, DL a-Ketoheterocycle inhibitors of fatty acid amide hydrolase: exploration of conformational constraints in the acyl side chain. Bioorg Med Chem22:2763-70 (2014) 
 
Fatty-acid amide hydrolase 1 [30-579]
Name:Fatty-acid amide hydrolase 1 [30-579]
Type:Single-pass membrane protein; homodimer
Mol. Mass.:60474.00
Organism:Rattus norvegicus (rat)
Description:P97612 (aa 30-579)
Residue:550
BDBM50012162
NameBDBM50012162
Synonyms:CHEMBL3264466
TypeSmall organic molecule
Emp. Form.C24H18N2O3
Mol. Mass.382.4113
SMILESO=C([C@H]1COc2cc(ccc2C1)-c1ccccc1)c1ncc(o1)-c1ccccn1