Reaction Details
TargetFatty-acid amide hydrolase 1 [30-579]
LigandBDBM50012165
Substrate/Competitorn/a
Meas. Tech.ChEMBL_1352947 (CHEMBL3269814)
Ki 16±n/a nM
Citation Duncan, KKOtrubova, KBoger, DL a-Ketoheterocycle inhibitors of fatty acid amide hydrolase: exploration of conformational constraints in the acyl side chain. Bioorg Med Chem22:2763-70 (2014) 
 
Fatty-acid amide hydrolase 1 [30-579]
Name:Fatty-acid amide hydrolase 1 [30-579]
Type:Single-pass membrane protein; homodimer
Mol. Mass.:60474.00
Organism:Rattus norvegicus (rat)
Description:P97612 (aa 30-579)
Residue:550
BDBM50012165
NameBDBM50012165
Synonyms:CHEMBL3264469
TypeSmall organic molecule
Emp. Form.C20H17NO4
Mol. Mass.335.3533
SMILESO=C([C@@H]1COc2cc(OCc3ccccc3)ccc2C1)c1ncco1