Reaction Details
TargetFatty-acid amide hydrolase 1 [30-579]
LigandBDBM50012174
Substrate/Competitorn/a
Meas. Tech.ChEMBL_1352947 (CHEMBL3269814)
Ki 20±n/a nM
Citation Duncan, KKOtrubova, KBoger, DL a-Ketoheterocycle inhibitors of fatty acid amide hydrolase: exploration of conformational constraints in the acyl side chain. Bioorg Med Chem22:2763-70 (2014) 
 
Fatty-acid amide hydrolase 1 [30-579]
Name:Fatty-acid amide hydrolase 1 [30-579]
Type:Single-pass membrane protein; homodimer
Mol. Mass.:60474.00
Organism:Rattus norvegicus (rat)
Description:P97612 (aa 30-579)
Residue:550
BDBM50012174
NameBDBM50012174
Synonyms:CHEMBL3264477
TypeSmall organic molecule
Emp. Form.C19H14INO4
Mol. Mass.447.2232
SMILESIc1cnc(o1)C(=O)[C@H]1COc2cc(Oc3ccccc3)ccc2C1