Reaction Details
TargetFatty-acid amide hydrolase 1 [30-579]
LigandBDBM50342065
Substrate/Competitorn/a
Meas. Tech.ChEMBL_1352947 (CHEMBL3269814)
Ki 4.4±n/a nM
Citation Duncan, KKOtrubova, KBoger, DL a-Ketoheterocycle inhibitors of fatty acid amide hydrolase: exploration of conformational constraints in the acyl side chain. Bioorg Med Chem22:2763-70 (2014) 
 
Fatty-acid amide hydrolase 1 [30-579]
Name:Fatty-acid amide hydrolase 1 [30-579]
Type:Single-pass membrane protein; homodimer
Mol. Mass.:60474.00
Organism:Rattus norvegicus (rat)
Description:P97612 (aa 30-579)
Residue:550
BDBM50342065
NameBDBM50342065
Synonyms:(S)-(6-phenoxy-1,2,3,4-tetrahydronaphthalen-2-yl)(5-(pyridin-2-yl)oxazol-2-yl)methanone | CHEMBL1765831
TypeSmall organic molecule
Emp. Form.C25H20N2O3
Mol. Mass.396.4379
SMILESO=C([C@H]1CCc2cc(Oc3ccccc3)ccc2C1)c1ncc(o1)-c1ccccn1