Reaction Details
TargetNeutral cholesterol ester hydrolase 1
LigandBDBM50012157
Substrate/Competitorn/a
Meas. Tech.ChEMBL_1352949 (CHEMBL3269816)
IC50>100000±n/a nM
Citation Duncan, KKOtrubova, KBoger, DL a-Ketoheterocycle inhibitors of fatty acid amide hydrolase: exploration of conformational constraints in the acyl side chain. Bioorg Med Chem22:2763-70 (2014) 
 
Neutral cholesterol ester hydrolase 1
Name:Neutral cholesterol ester hydrolase 1
Type:Single-pass type II membrane protein; hydrolase
Mol. Mass.:45742.11
Organism:Mus musculus (mouse)
Description:Assays were using membranes of recombinant KIAA1363 transiently transfected in COS-7 cells.
Residue:408
BDBM50012157
NameBDBM50012157
Synonyms:CHEMBL3264462
TypeSmall organic molecule
Emp. Form.C24H18N2O4
Mol. Mass.398.4107
SMILESO=C(C1CCc2cc(Oc3ccccc3)ccc2O1)c1ncc(o1)-c1ccccn1